Gradle:无法初始化类org.codehaus.groovy.runtime.InvokerHelper [英] Gradle: Could not initialize class org.codehaus.groovy.runtime.InvokerHelper

查看:2388
本文介绍了Gradle:无法初始化类org.codehaus.groovy.runtime.InvokerHelper的处理方法,对大家解决问题具有一定的参考价值,需要的朋友们下面随着小编来一起学习吧!

问题描述

我看到了此gradle错误:无法初始化org.codehaus.groovy.runtime.InvokerHelper类".我尝试了多种在线列出的方法来解决此问题,但没有运气.在调试过程中,我发现了奇怪的JVM版本.

I saw this gradle error: "Could not initialize class org.codehaus.groovy.runtime.InvokerHelper". I have tried multiple ways listed online to fix the issue but no luck. During the debugging, I found weird JVM version.

已安装Java 14,并且已经在bash_profile的JAVA_HOME中设置了路径.但是,gradle显示了JVM 13版本.我不确定是否会导致错误:无法初始化类org.codehaus.groovy.runtime.InvokerHelper

Installed Java 14 and I have set the path in JAVA_HOME in bash_profile. However, gradle shows JVM 13 version. I am not sure if this cause the error: Could not initialize class org.codehaus.groovy.runtime.InvokerHelper

我的Java版本

java version "14.0.1" 2020-04-14
Java(TM) SE Runtime Environment (build 14.0.1+7)
Java HotSpot(TM) 64-Bit Server VM (build 14.0.1+7, mixed mode, sharing)

Gradle版本,但不确定为什么JVM显示13

Gradle version, but not sure why JVM shows 13

Gradle 6.5
------------------------------------------------------------

Build time:   2020-06-02 20:46:21 UTC
Revision:     a27f41e4ae5e8a41ab9b19f8dd6d86d7b384dad4

Kotlin:       1.3.72
Groovy:       2.5.11
Ant:          Apache Ant(TM) version 1.10.7 compiled on September 1 2019
JVM:          **13.0.2 (Oracle Corporation 13.0.2+8)**
OS:           Mac OS X 10.14.6 x86_64

分级错误

npx react-native run-android
info Running jetifier to migrate libraries to AndroidX. You can disable it using "--no-jetifier" flag.
Jetifier found 960 file(s) to forward-jetify. Using 4 workers...
info JS server already running.
info Launching emulator...
info Successfully launched emulator.
info Installing the app...

FAILURE: Build failed with an exception.

* What went wrong:
Could not initialize class org.codehaus.groovy.runtime.InvokerHelper

* Try:
Run with --stacktrace option to get the stack trace. Run with --info or --debug option to get more log output. Run with --scan to get full insights.

* Get more help at https://help.gradle.org

BUILD FAILED in 3s

error Failed to install the app. Make sure you have the Android development environment set up: https://reactnative.dev/docs/environment-setup. Run CLI with --verbose flag for more details.
Error: Command failed: ./gradlew app:installDebug -PreactNativeDevServerPort=8081

FAILURE: Build failed with an exception.

* What went wrong:
Could not initialize class org.codehaus.groovy.runtime.InvokerHelper

* Try:
Run with --stacktrace option to get the stack trace. Run with --info or --debug option to get more log output. Run with --scan to get full insights.

* Get more help at https://help.gradle.org

BUILD FAILED in 3s

推荐答案

更改gradle的版本

YOUR_PROJECT/android/gradle/wrapper/gradle-wrapper.properties 中编辑文件并更改版本

change the version of the gradle

edit the file in YOUR_PROJECT/android/gradle/wrapper/gradle-wrapper.properties and change the version

从:

distributionUrl = https://services.gradle.org/distributions/gradle- 6.0.1 -all.zip

收件人:

distributionUrl = https://services.gradle.org/distributions/gradle- 6.4.1 -all.zip

来源: https://github.com/gradle/gradle/issues/10248#issuecomment-633656326

这篇关于Gradle:无法初始化类org.codehaus.groovy.runtime.InvokerHelper的文章就介绍到这了,希望我们推荐的答案对大家有所帮助,也希望大家多多支持IT屋!

查看全文
相关文章
登录 关闭
扫码关注1秒登录
发送“验证码”获取 | 15天全站免登陆